Semop1 Encountered An Error Invalid Argument

Failed to Create An Empty Document Error Fix

RECOMMENDED: If you have Windows errors then we strongly recommend that you download and run this (Windows) Repair Tool.

Mar 31, 2016. FATAL: Creation of MOS mirror FAILED, check logs at /var/log/mirror-sync. * FATAL: Creation of Ubuntu mirror FAILED, check logs at /var/log/mirror-sync. make[2]: Leaving directory `~/opnfv/fuel/fuel/build/f_isoroot/f_repobuild'. make[2]: *** [.nailgun] Error 1. semop(1): encountered an error: Invalid argument.

Feb 3, 2014. Check if int semid = semget(key, sem, 0666);. returns success or failure. As @ VladLazaranenko mentioned there could be a lot of possible errors. Check every single return code for every single function you call (if they return a value) – for production systems.

Lizzie Buttrose: Police called to Sydney socialite’s Vaucluse home after argument – At the house police encountered an upset Buttrose having an argument with her live-in partner Scott Fay. It was in March last year that the couple famously rowed after a night out at the nearby Watson’s Bay Hotel. When Fay, a 42.

Error C4430 Missing Type Specifier – Int Mar 16, 2009. error C2143: syntax error : missing ',' before '&' error C4430: missing type specifier – int assumed. Note: C++ does not support default-int error C2143: syntax error

Sep 2, 2005. [2005-09-02 11:22 UTC] gamr at gamrdev dot com. Description: ———— current apc and php from cvs, non thread safe [Tue Oct 4 01:40:40 2005] [apc-error] apc_sem_lock: semop(655371) failed: Invalid argument [Tue Oct 4 01:40:40 2005] [apc-error] apc_sem_lock: semop(655371) failed: Invalid.

If American military strategy assumes popular support from Iraqis facilitating an invasion and occupation, the White House is making an error that could haunt us. few people willing to fight for Saddam, I encountered plenty of nationalists.

Stupid Argument #9a: Argument from silence. The Jewish leaders would’ve been eager to shut down a rogue sect. If Jesus hadn’t risen from the dead, they would’ve pointed to the dead body. Faced with this refutation of their most.

Feb 4, 2003. BBL.1268: LIBTUX_CAT:248: ERROR: System init function failed, Uunixerr = : shmdt: Invalid argument. encountered; initiating user error handler 231204. egsaturn!tmboot.1267: FATAL: CMDTUX_CAT:828:. 10 max operations per semop call (SEMOPM) 10 max undo entries per process (SEMUME)

GENERAL ERROR: An invalid argument was encountered Error. You may also refer to the English Version of this knowledge base article for up-to-date information. Get.

This usually seems to appear when I am deleting photos from my picture organizing program, Olympus Master 2. The thing I was trying to do appears to happen in spite.

Visual Basic 2010 Syntax Error In From Clause How to Integrate Excel Data Into a Word Document – It’s surprisingly easy to integrate Excel data into Word once you know how to add the right references, and how

Fix Semop1 Encountered An Error Invalid Argument (Solved) – Semop1 Encountered An Error Invalid Argument. Ggouaillardet referenced this issue Oct 7, 2016 Open plug leaks on finalize which command fails. 'puppet' Puppet run failed.

I'm using as an email client Incredimail Plus and started to receive popup ImApp error "An invalid argument was encountered" I just click OK and it goes away with no.

RECOMMENDED: Click here to fix Windows errors and improve system performance