Error Cs1501 Unity

Fixing Line Endings Error - Unity Tips

RECOMMENDED: If you have Windows errors then we strongly recommend that you download and run this (Windows) Repair Tool.

Nov 21, 2016  · Hi, I am new to Unity. I am working in Android program. I need to convert String to Int. Is there any way to convert String to Int.

Unity 2017.1.0f3 Released · Issue #767 · Microsoft. – GitHub – #669 appears to still be an issue with the stable release. When updating one of my projects I ran into Assets/HoloToolkit/Utilities/Shaders/FastConfigurable/Editor /CustomMaterialEditor.cs(103,23): error CS1501: No overload for method BeginAnimatedCheck' takes 1' arguments.

Hi i updated today to the new 5.4.of3 and it now its broke a lot of stuff with my game. the error. Assets/Sripts/BrackeysTutorialC#/HostGame.cs(32,39): error CS1501: No overload for method `CreateMatch' takes `5′ arguments. public void CreateRoom() { if(roomName != “” && roomName != null) { Debug.

Nov 9, 2015. Well, the error message should be plain – you're calling the checkStatus method with a single argument, while it is declared with no arguments. Either you need to add an argument to the method declaration (and use it somehow), or you need to change the calls to pass no argument. It seems that your intent.

I'm trying to make my character dodge when pressing a key, but I keep geting this error CS1501: No overload for method Dodge' takes2' arguments here's the part of.

Apr 25, 2015. Hi I've got a problem and i need help this has bean stuck on this for days and have not found a way to fix it so if u can help it will be greatly appreciated. EnemyBehaviour.cs(19,25): error CS1501: No overload for method TakeDamage ' takes 0' arguments. using UnityEngine; using System.Collections;.

Unity is the ultimate game development platform. Use Unity to build high-quality 3D and 2D games, deploy them across mobile, desktop, VR/AR, consoles or the Web, and.

Error CS1501 | Unity Community – Hi there, Why am I getting this error? It states that, "error CS1501: No overload for method `InvokeRepeating' takes `1' arguments" Here is my code.

Nov 3, 2014. You are calling the Dodge method by passing two arguments, for example: Dodge(DodgeDirection.Forward, dodge); but your method only asks for one: public void Dodge(DodgeDirection dir). So in order to solve this, you have two options: Pass only one parameter in the FixUpdate method. Add a second.

Error 4248 Was Generated By Microsoft Word Interestingly, Robot Jones was voiced by Microsoft Word 98’s. style to Rocky and Bullwinkle, which generated an older fan base. Every episode was divided. I read elsewhere that this error

Unity is the ultimate game development platform. Use Unity to build high-quality 3D and 2D games, deploy them across mobile, desktop, VR/AR, consoles or the Web, and.

I keep getting this error when I run my code and I can't quite see what the problem is: error CS1501: No overload for method checkStatus' takes `1' arguments In my.

RECOMMENDED: Click here to fix Windows errors and improve system performance