Error C2238 Unexpected Token

RECOMMENDED: If you have Windows errors then we strongly recommend that you download and run this (Windows) Repair Tool.

An incorrect token was found. Ex: // compile with: /c class v { virtual: int vvv; // C2238 };

unexpected token(s) preceding 'token' An incorrect token, or tokens, was found before the specified token. This error can be caused by an invalid name in a bit-field.

I'm trying to port a program/game that was developed in linux/g++ so that it runs on windows 7 VS 2008 C++. The program uses libraries such as OpenGL, SDL, and Boost.

. C2059: syntax error : 'return' c:program filesmicrosoft visual studio 8vc includexlocale(147) : error C2238: unexpected token(s) preceding.

Error De Sincronizacion Google Chrome 16 May 2016. Sincronizar tus marcadores, Speed Dial, pestañas y más en Opera navegador es muy simple. Disfruta tu contenido favorito en todos tus. Chrome is fit for the workplace

Error compiling MFC code – CodeProject – NETVc7atlmfcincludeatlsimpstr.h(218) : error C2238: unexpected token(s) preceding ';' C:Program Files (x86)Microsoft Visual Studio.

I am currently trying to follow a tutorial on making a simple 2D tile engine for top-down RPGs. For some reason though I get the intellisense error vector is not a.

Compiler Error C2238. 11/04/2016 1 minutes to read Contributors. In this article. unexpected token(s) preceding 'token' An incorrect token was found.

resolve C++ class template errors on my list. Error 48 error C2238: unexpected token(s) preceding ';' Error 2 error C4430: missing type specifier.

The articles in this part of the documentation contain information about a subsection of the Visual C++ compiler errors. You can access the information here or, in.

Is there a VideoWriter for Windows? – Cinder – Jun 19, 2017. 1>VideoWriterTestApp.obj : error LNK2019: unresolved external symbol "public: __thiscall. error C2238: unexpected token(s) preceding.

RECOMMENDED: Click here to fix Windows errors and improve system performance