Error C2079 Template

Tutorial 1 - Setting up an OpenGL Project in Visual Studio 2010

RECOMMENDED: If you have Windows errors then we strongly recommend that you download and run this (Windows) Repair Tool.

When you upgrade to a new version of the Visual C++ compiler, you might encounter compilation and/or runtime errors in code that previously compiled and ran correctly.

Event Id 36888 Error 1203 and that legendary Nintendo video game designer Shigeru Miyamoto will host a developer roundtable event later that day." Nov 18, 2015. We are experiencing the following schannel errors most frequently

Nov 6, 2008. My hint: give your formal template arguments a different name than the actual ones. (i.e. class M) // template definition file #include <list> template< class aM, class aT > class C { std::list<M> m_List;. }; Example of a bad forward declaration , resulting in the mentioned error: // bad template usage file causing.

Oct 27, 2015. And what is really strange in that issue, is if I uncomment the "template line" ( before class Toto declaration), the error disapear. As @Angew points out, this might happen with a non-compliant compiler. For example, g++ outputs proper error diagnostic: main.cpp:7:9: error: field 'a' has incomplete type 'foo'.

Apr 17, 2012. Your constructor definition should be: template<class Loc, class T> LocTree<Loc, T>::LocTree() { }. Also, hoping to keep them separate. – don't – you're wasting your time. The only way to keep them separate is to have a definition in a different header which you also include. So, technically, they are.

Error 720 Winxp Jun 22, 2017. Finally, I got a solution for VPN error 720. There is problem with a VPN server IP address that not working properly. You need to assign valid

error c2079 template. here for a quick overview of the site Help Center Detailed answers to any uses undefined class template questions you might have Meta Discuss.

Jun 20, 2009  · This question is asked quite often, so here is a way of doing it using stringstreams:

d:x.h(19) : error C2079: 'c' uses undefined class 'CArray<class CString>' d:x.h( 25) : error C2976: 'CArray' : too few template arguments d:program filesmicrosoft visual studiovc98mfcincludeafxtempl.h(238) : see declaration of 'CArray' d:x.h( 25) : error C2079: 'd' uses undefined class 'CArray<struct M>'

I have error C2079 on compiling following code and I dont understand why. class foo is declared later (forward declaration). class foo; //template <typename dataType.

Compiler Error C2039 – msdn.microsoft.com – Compiler Error C2079. Compiler Error C2081. Compiler Error C2082. Compiler Error C2083. Compiler Error C2039. Visual Studio 2015 Other Versions.

All rights reserved. main.cpp main.cpp(2): error C2988: unrecognizable template declaration/definition main.cpp(2): error C2059: syntax error: '>' cstdint(18): error. class template is not allowed ymath.h(41): error C2646: an anonymous union at global or namespace scope must be declared static ymath.h(41): error C2079:.

VC5.0 compiler generates error C2079. template <class T> class X. C++ templates allow one to implement a generic Queue<T> template that has a type parameter.

To determine the cause of the error, examine not only the line that's listed in the error message, but also the lines above it. If examining the lines yields no clue about the problem, try commenting out the line that's listed in the error message and perhaps several lines above it. If the error message occurs on a symbol that.

Error Sc 322 Ricoh 1045 SPC320dn. Ricoh+Aficio+SP. حل+عطل+322+326+SC+323SCمرامي+شركة. แก้ricoh+sp3510dn+error+sc542Reset+codigo+de+falla+SC+542+Aficio+SP+3510Aficio. Ricoh copiers error messages. SC-327 Laser 1 home position error SC-328 Laser 2 home position error SC-329 Download – UpdateStar – UpdateStar.com – The database recognizes

undefined class errors (C2079) 0. I'm getting this error: error C2079:. Heres what I found on the error it occurs "If an instantiation of a class template is.

Sep 21, 2017  · PDF files that contain the Visual Studio 2005 documentation.

error C2079: 'stackNameSpace::StackNode<T>::value' uses. – error C2079: 'stackNameSpace::StackNode<T>::value' uses undefined class. { template<class T> struct StackNode. I get an error in main() that "error C2079:.

RECOMMENDED: Click here to fix Windows errors and improve system performance