Error Building Bundle Unresolved References To

R cannot be resolved to a variable - Android Error

RECOMMENDED: If you have Windows errors then we strongly recommend that you download and run this (Windows) Repair Tool.

I'm developing web application with OSGI. I have a maven configuration error which I cannot find. This is the complete source code: http://uploading.c.

Eclipse/Maven problems. Bundle Errors "Error building bundle com.searchtechnologies:<bundle> : Unresolved references to [<some.package>].

OSGi Tooling; Building OSGi Bundles; Sample POM File. Index. List of Figures. 1.1. Fuse ESB kernel Architecture; 1.2. OSGi Transaction Architecture; 10.1. Reference to Stateless Service; 10.2. List of References to Stateful Services; 11.1. How Maven Locates Artifacts at Build Time; 11.2. How the Container Locates Artifacts.

Ask the Experts We know RTI can be confusing at times, which is why we’ve lined up some of the most knowledgeable people to help. Check below for.

PHP 5 ChangeLog Version 5.6.32 26 Oct 2017. Date: Fixed bug #75055 (Out-Of-Bounds Read in timelib_meridian()). mcrypt: Fixed bug #72535 (arcfour encryption stream.

homemadegospel.org – Gospel Music – Eclectic gospel music site. New music and church reports added on a regular basis. My home church is famous Berean Seventh-day Adventist Church in Atlanta GA.

Note that in the case of action developer error, the action may have partially run and generated. For any npm packages that are not pre-installed in the Node.js environment, you can bundle them as dependencies when you create or.

Sqlstate 21s01 Error Code 1136 Mysql Error 1136 (21s01). Not the answer you're looking for? Error Code 1136 Mysql. For what reason would someone not want HSTS on every subdomain? Zen Cart and it's community

Errors using maven-bundle-plugin Embed-Dependency. [ERROR] Error building bundle net.stevex. bundle:1.0-SNAPSHOT : Unresolved references to [dalvik.

Mar 7, 2015. [INFO] Checking unresolved references to org.codehaus.mojo.signature:java16: 1.1. st (bundle-manifest) on project mybatis-generator-maven-plugin: Error(s) found i n manifest configuration -> [Help 1] [ERROR] [ERROR] To see the full stack trace of the errors. I do not have this issue when I run the build.

To use the Lifecycles library, you need to add the following to your module-level.

. Unresolved references to. 0, Errors: 0, Skipped: 0 [INFO] [bundle:bundle {execution: default-bundle}] [ERROR] Error building bundle felix-tutorial.

This section describes the release notes for the CUDA Samples only. For the release notes for the whole CUDA Toolkit, please see CUDA Toolkit.

PHAM, Bao Ngoc – CCA, 4.2.2005 Sully, Dunford & Hidden JJ Citation: R v Pham [2005] NSWCCA 9 Conviction and sentence appeal. Murder. 25y with NPP of 20y.

a strange problem, about Bundle. plugin. then show the below Error [ERROR] Error building bundle. bundle:0.0.1-SNAPSHOT : Unresolved references to.

Linux man pages: alphabetic list of all pages. Jump to letter:. 3 a b c d e f g h i j k l m n o p q r s t u v w x y z

Since we won’t be able to cover everything related to JS performance in a 2000 word article, make sure you read the references and do. async () => {}’)(); } catch.

But, at best, the Clippers are looking at a package built around a bundle of role.

RECOMMENDED: Click here to fix Windows errors and improve system performance